Oracle ASM - crsctl.bin executable - wrong ELF class: ELFCLASS32

I’m trying to get ASM working on 10g (Oracle Database 10g Enterprise Edition Release 10.2.0.1.0 - 64bit Production) on solaris 8 but am encountering the issue described below.When I try to create a new database and configure it to use ASM I get a dialog informing me that “In order to use ASM the ...

i installed mysql on solaris10,when i am installing FreeRadius2.1.6 ......facing belwo problem .........ld: fatal: file .libs/sql_mysql.o: wrong ELF class: ELFCLASS32

i installed mysql-5.0.83-solaris10-sparc-64bit.pkg.gz on solaris10. tring to install freeeradius2.1.6 while gamke iam facing below problem. /opt/packages/freeradius-server-2.1.6/libtool --mode=link gcc -release 2.1.6 \ -module -export-dynamic -o rlm_sql_mysql.la \ -rpath /usr/local/lib sql_mysql.lo ...

MySQL make: wrong ELF class: ELFCLASS32

I've been struggling to make the c++ connector. It seems to fail due to a 32/64bit mismatch in files but I cant find it. The system is Solaris 10 x86_64 and MySQL 5.1.39. Any help would be greatly appreciated. Best Regards, Patrick bash-3.00# tar xvf mysql-connector-c++-1.0.5 [no errors] bash-3.00# ...

Oracle ld: fatal: /lib/libmakestate.so.1: wrong ELF class: ELFCLASS32"

I installed Oracle 9011 EE on Solaris 8, using silent repsonseFile mode.The log showed problems in all link targets and trying to relink allI got:"ld: fatal: dlopen() of support library (libmakestate.so.1) failed with error: ld.so.1: /usr/ccs/bin/sparcv9/ld: fatal: /lib/libmakestate.so.1: wrong ELF ...

Ubuntu What should I do for this error: [pid 7413] 18:44 ... ELF class: ELFCLASS32

The whole line is: [pid 7413] 18:44:40.213934 select(LoadPlugin: failed to initialize shared library /opt/real/RealPlayer/mozilla/nphelix.so [/opt/real/RealPlayer/mozilla/nphelix.so: wrong ELF class: ELFCLASS32]I get this from a number of straces and every time it happens my system locks up. It happ ...

Ubuntu amarokapp libGL.so.1: wrong ELF class: ELFCLASS32

When I start Amarok I get he following error:Amarok: [Loader] Starting amarokapp..Amarok: [Loader] Don't run gdb, valgrind, etc. against this binary! Use amarokapp.amarokapp: error while loading shared libraries: libGL.so.1: wrong ELF class: ELFCLASS32I use Ubuntu 8.10 64-bit. ...

Ubuntu libmad.so.0: wrong ELF class: ELFCLASS32

chpn@chpn-desktop:~$ xmotoxmoto: error while loading shared libraries: libvorbisfile.so.3: wrong ELF class: ELFCLASS32chpn@chpn-desktop:~$ mplayermplayer: error while loading shared libraries: libvorbis.so.0: wrong ELF class: ELFCLASS32It was all right before, I copied some wrong libraries to /usr/l ...

Ubuntu libthread2.6.3.so: wrong ELF class: ELFCLASS32

i trying to execute a Oracle DBA monitoring tool (named ASHMON/PERFVISION OEMLITE - www.perfvision.com) but i received the following error:./ashmon.shError in startup script: couldn’t load file “/app/oracle/ashmon/bin/../lib/thread2.6.3/libthread2.6.3.so”: /app/oracle/ashmon/bin/../lib/thread2.6. ...

wrong ELF class: ELFCLASS32

I need the 64-bit version of this class. I have installed OmniFind on a 64-bit machine, and some of the classes need to be 64-bit.Where can I download the 64-bit version of this class? Also, where is it installed in a typical OmniFind installation? ...

install error: linking of ctxhx.o: Wrong ELF class: ELFLCASS32

I am new to Oracle and bumped into the following install error when I install Oracle 9i on Solaris 9. Please shed some light. Thanks!This is extracted from $ORACLE_HOME/install/make.log/usr/ccs/bin/ld -o ctxhx -L/usr/opt/home/oracle/9.2.0/ctx/lib/ -L/usr/opt/home/oracle/9.2.0/lib/ -dy /usr/opt/home/ ...

wrong ELF class (HELP PLEASE!)

This is the message I get when I boot my laptop:/usr/bin/X: error while loading shared libraries: libXfont.so.1: wrong ELF class: ELFCLASS32Does anyone know what to do? I really can't seem to figure it out and I'm not quite sure where to look. Please help me.~ ...

Ubuntu gambas2 libqt-mt.3 wrong elf-class

I am sorry if this is already posted. I could not find this else whereI am running ubuntu 10.10 x64. I have gambas2 2.21.0-1 installed but when I try to run the following error occurs.ERROR: ld.so: object 'libqt-mt.so.3' from LD_PRELOAD cannot be preloaded: ignored.ERROR: #27: Cannot load component ...

Ubuntu Elfclass32

I get this error how do I fix it? (I was updating to Edgy Eft) /usr/bin/X: error while loading shared libraries: libXfont.so.1: wrong ELF class: ELFCLASS32What do I do to get over this? ...

Ubuntu wrong ELF class (HELP PLEASE!)

This is the message I get when I boot my laptop:/usr/bin/X: error while loading shared libraries: libXfont.so.1: wrong ELF class: ELFCLASS32Does anyone know what to do? I really can't seem to figure it out and I'm not quite sure where to look. Please help me.~ ...

Ming Install

I have installed the Ming library from http://www.libming.org but I have run into problems installing the PHP bindings as described here http://www.libming.org/Installing_Language_BindingsWhen I run make in the php_ext directory I get this:-sudo make/bin/bash ./make_module.sh .cp: omitting directory ...

Restore 32bit backup to 64bit OS

How can I fix the problem below after restoring a 32bit database on a 64bit ? Will rebinding all the stored procedures fix it. Thanks db2level DB21085I Instance "db2inst1" uses "64" bits and DB2 code release "SQL08022" with level identifier "03030106".Informat ...

Ubuntu Wine crashes with everything except notepad.

When I try to run a program using (for example) "wine gens", I get this dialog:The program gens.exe has encountered a serious problem and needs to close. We are sorry for the inconvenience.The terminal has this to say about it:Xlib: extension "GLX" missing on display ":0.0 ...

Ubuntu WSPR on x64?

I've installed WSPR on ASUS EeePC from .deb package at Princeton.edu/pulsar/K1JT/wspr.html (http://physics.princeton.edu/pulsar/K1JT/wspr.html) and running fine.I'm now attempting to get it running on desktop (purely because its running 24/7) but package is for i386 machines only.Tried installing fr ...

lost yum?

I just tried to install fedora on my second (hdb) to see how the 64 bit works, I have Fedora 5 386 on (hda) and i was sailing along very well, But I'm just addicted to trying out things, well after rebooting I came back to find that the 64 bit took over the 368 on my primary, no problem except now i ...

Ubuntu libcanberra-gtk.so.0

gnome-volume-control: error while loading shared libraries: libcanberra-gtk.so.0: wrong ELF class: ELFCLASS32Ok i probably screwed this up today, i might have installed the 32 bit version of this.But now i cant find how to change back to the 64bit. Can someone point me to the right package. ...

32 libraries problem on Red Hat DS 5 64

Okay Guys, i have some problems with 32 bits apps on Red Hat 5.1 DS 64 bits.I have the same apps running ok without problem, in RH 3 64 bits.[root@localhost /usr/lib/qt-3.3/lib]$ locate libc.so.6/lib/libc.so.6/lib/i686/nosegneg/libc.so.6/lib64/libc.so.6[root@localhost /usr/lib/qt-3.3/lib]$ ls -l /li ...

Problem with KotOR 2

guys, I recently installed Knight Of The Old Republic 2: The Sith Lords on wine. (Im using FedoraCore 9)I went through the installation without any problems, extremely contented with how well wine was working, and when it was finished, it opened the launcher, I configured some options, and then I go ...

CentOS x86_64, i cant compile from sources

i have installed an IDS (Sguil), and the sensor part of the system is installed on Centos 5.1 x86_64 using a Sun XFire 4400...the problem is that i want to change a snort 2.8.0.1 compiled from srcRPM because i can't tuning the snort.conf very well, some changes affect the network cards on boot, don' ...

Cognos82 Installation - Issue with SunOne Web Server(Please help)

We are getting below error while configuring Sun One Web Server.We are working on the installation of cognos8.2 on Solaris operating system. Currently we got struck up with starting Cognos82 servlet gateway in SunOne webserver. Below are details about our so far activities...1. Installation of cogno ...

ld: fatal: Symbol referencing errors. No output written to mysql_tzinfo_to_sql

I'm trying to build 64 bit mysql-5.0.37 on Solaris 10. CFLAGS="-O3" CXX='gcc -m64 -mcpu=v9' CXXFLAGS="-O3 -felide-constructors -fno-exceptions -fno-rtti" ./configure –disable-shared --prefix=/usr/local/mysql --datadir=/home1/mysql_data --with-mysqld-user=mysql LD_LIBRARY_PATH=/ ...

can i install mysql odbc 32bit driver on solaris 10 64bit?

i want to install mysql odbc 32bit driver on solaris 2.10 64 bit machine (to the specific path not by default). machine info: SunOS testserver 5.10 Generic_118822-23 sun4u sparc SUNW,Sun-Fire-480R Solaris got install tar ball: mysql-connector-odbc-3.51.20-solaris10-sparc-32bit.tar.gz after installat ...

Ubuntu Wine Help

I had the 32 bit version of ubuntu installed; with wine 1.24 and rosetta stone working just fine on it. I deleted that distro and upgraded to 64bit with wine 1.24 and rosetta stone was working just fine. The developement release of wine 1.25 came out; and my computer grabbed it from the repos and up ...

Ubuntu wine--programs don't run

guys, I just had a question about wine:when i try to run poweriso, I get:joe@ubuntu:~$ wine '/home/joe/.wine/dosdevices/c:/Program Files/PowerISO/PowerISO.exe' fixme:win:LockWindowUpdate (0x4007a), partial stub!fixme:win:LockWindowUpdate ((nil)), partial stub!fixme:win:LockWindowUpdate (0x4007a), pa ...

Oracle link problem 9011 Solaris 8

I installed 9011 EE on Solaris 8, using silent repsonse file mode.The result showed problems in all link targets and trying to relink allI got:"ld: fatal: dlopen() of support library (libmakestate.so.1) failed with error: ld.so.1: /usr/ccs/bin/sparcv9/ld: fatal: /lib/libmakestate.so.1: wrong ELF cla ...

Alice in 64-bit ubuntu

I am currently trying to use Alice (http://www.alice.org) on my 64-bit ubuntu 8.10 Desktop. I downloaded it from the site. I run the run-alice file from the folder in the terminal. It came up with lots of messages but stopped.This is the results generated.attempting to register mp3 capability... Reg ...

Ubuntu UT99 does not start

Mounted the UT99 .iso and ran the installer. However, when i open it it does not start. Here is the output:zopiac@zopiac-desktop:~$ wine /home/zopiac/.wine/drive_c/UnrealTournament/System/UnrealTournament.exe wine: Unhandled privileged instruction at address 0x40aae4 (thread 0009), starting debugger ...

Ubuntu Morrowind + Hardy 64-bit + Wine = Nothing?

I just installed Morrowind through wine on a 64 bit Hardy Heron install, then when I run the program I get the following:fixme:win:EnumDisplayDevicesW ((null),0,0x32f118,0x00000000), stub!fixme:d3d:test_pbo_functionality >>>>>>>>>>>>>>>>> GL_INVALID ...

Ubuntu MPlayer has finished unexpectedly. Exit Code 127

i have downloaded SMplayer because it's the bedt player for subtitles , today i tried to run an arabic subtitle but i cannot so i searched for that on google and founs someone who did that , i have installed a file and run it but when i ran it, it says its corrupted then i tried to open an file with ...

undefined reference to `link'

error message while building.undefined reference to `link'In function `_link_r'powerpc-elf/lib/libm.a powerpc-elf/lib/libc.a powerpc-elf/lib/libsim.a /lib/gcc/powerpc-elf/4.1.1/libgcc.a ...

run j2me programs on ubuntu x64

HiI'm novice in ubuntu , i'm using NetBeans IDE for j2me programming but i have a praoblem : emulator do not work !!! when i'll run program dose not work and this message is displayed :java.lang.UnsatisfiedLinkError: /home/mahdi/netbeans-6.7/mobility8/WTK2.5.2/bin/sublime.so: /home/mahdi/netbeans-6. ...

Ubuntu VNC4 server OpenGL issues--Wine can't find OpenGL

PC: ATI Radeon 9800 and Ubuntu 8.04.Normally, I appear to be able to use my graphics card just fine.glxgears gives me 5258 FPS miniscreen, and I get 350-450 FPS in fullscreen. I can run those 3D Tron lightcycle games perfectly, along with Defcon and other 3D games in Wine great.However, when I try t ...

Ubuntu Alice 3D Programming (Won't Work!)

I'm taking a college class that requires this, and I really, really don't want to switch back to Windows for this stupid thing...It's called Alice.http://www.alice.org/I am running Ubuntu 8.04 64bit.This is what happens when I try to run the program:chris@chris-desktop:~/Alice/Required$ ./run-alicea ...

Syntax error with openssl and apache

I use RHEL 5 and i am trying to configure openssl 2.2 with apache2.215 and i am getting the below error. Any help would be appreciated.httpd: Syntax error on line 414 of /usr/local/apache2/conf/httpd.conf: Syntax error on line 1 of /Application/web_agents/apache22_agent/Agent_001/config/dsame.conf: ...

Ubuntu Flash and slow internet

I am using FF 3 in kubuntu 64 bit. and i have the adobe non-free flash plugin. Youtube works, but when i go to the video it always takes about 20 for the video to start up ( its not downloading ) the whole browser just frezzes. Also when i open up a tab using flash, then a second, the flash will onl ...

Ubuntu How do i get oblivion to work on hardy?

When I run the game from the "shortcut" in my desktop, the launcher just comes up and then it disappears. When I hover over the launcher with my mouse, my mouse just disappears. When I go to the directory where the OblivionLauncher is and then "wine OblivionLauncher.exe" i just g ...

Ubuntu Aptana Install

I've been struggling with this for several days now and have gone through old posts with a fine toothed comb, but can't figure this out. Help.I downloaded and unzipped the standalone Aptana, when I go to launch it, it gives me an error and points me to this log file. I tried a couple things, but sti ...

Solaris, configure fails on gettext

checking for GNU gettext support... yeschecking for bindtextdomain in -lintl... nochecking for bindtextdomain in -lc... noconfigure: error: Unable to find required gettext libraryBoom. No matter what, I can't get gettext to pass. I've upgraded to gettext 0.14.1 but it still won't pass. Any thoughts? ...

But unInstallShield ISN'T running!

I'm trying to install Baldur's Gate with Wine, and I keep getting this error when I open setup.exe with Wine:Setup has detected that unInstallShield is in use. Please close unInstallShield and restart setup.Error 432.I'm pretty sure I don't have unInstallShield in use, but if I did, I'd have no idea ...

Chief Architect 10 loads, promptly crashes.

This is probably more related to the fresh Wine Windows installation I installed and the fact that I upgraded my rig to an AMD64. The whole install process went on flawlessly. As opposed to when I was on my 32 bit system back in November, whatever I did made the installation from all three CDs take ...

ATT program not loading

user@ekyle072:~$ wine "C:\Program Files\ZKSoftware\Att\att.exe"err:ole:CoGetClassObject class {00000514-0000-0010-8000-00aa006d2ea4} not registerederr:ole:create_server class {00000514-0000-0010-8000-00aa006d2ea4} not registerederr:ole:CoGetClassObject no class object {00000514-0000-0010-8 ...

Problems running Chikka

all, I'm fairly new to wine and Linux so please inform me if I missed something.I'm running Ubuntu 7.04 and Wine 0.9.46The program I'm trying to run is Chikka (Chikka: TXT for FREE from a PC)I completed the install with wine, and it put an icon on my desktop. When I would double click it it wouldn't ...

FIFA 08 on Wine

I'm trying to install Fifa 08 on Arch Linux with wine.2 phar0z@archlinux $ wine EASetup.exewine: could not load L"Z:\\mnt\\dvd\\EASetup.exe": Bad EXE format for And when I'm trying to investigate the exe file I receive:3 phar0z@archlinux $ file EASetup.exeEASetup.exe: ERROR: cannot read `E ...

Wine and Kaleidagraph error with wine

i am getting this error when trying to launch Kaleidagraph and after that the program is automatically closed this is the error or message i am having :fixme:mixer:ALSA_MixerInit No master control found on Intel ICH6 Modem, disabling mixerfixme:win:WINNLSEnableIME hUnknown1 0x7002e bUnknown2 1: stub ...

Photoshop CS installation

Whats the problem when i try to install photoshop CS (from CD):[juho@localhost Photoshop]$ wine setup.exewine: Unhandled page fault on write access to 0x00000000 at address 0x40b1cc (thread 0009), starting debugger...Unhandled exception: page fault on write access to 0x00000000 in 32-bit code (0x004 ...

SiteSpinner in Wine

Has anyone used SiteSpinner in Wine? I launch the installer and the Wine Debugger flashes across the screen, but I can't find a log file of what it echos and then it is gone in a fraction of a second...but the msi does not install.Here is what I get:scott@Ennio:/home$ msiexec /i ~/SiteSpinnerV270f.m ...