Oracle Where do I get the Jdeveloper Studio version 10.1.2.2?

H alli,I have to work on BPEL PM 10.1.2.0.2 , and hence require Jdeveloper Studio version 10.1.2.2?Can somebody guide where to obtain this from?Many ...

Oracle Can't download JDeveloper 10g Version 10.1.3. (FREE)

I get HTTP error 500 while trying to download using this link provided by your system:http://download.oracle.com/otn/java/jdeveloper/1013/jdevj2ee1013.zipI tried using IE 6 and Firefox 1.0.1 ...

Oracle JDeveloper

OTNServer nameFilenameDate/Time 07/21/2002 11:00 amBrowser + Version IE 6O/S + Version Windows XP ProfessionalError MsgI've install J2SE v1_4_0 in my machine. I have follow the instruction to download and install theJDeveloper (base version). I also update SetJavaHome in jdev.conf. When I start JDev ...

Oracle error: Invalid class file format , major-minor version is too recent

I am using ant 1.3 and with ant 1.5.4, I am getting the following error. Would applreciate if any have encountered this error and have resolved the same.I have the latest version of JDK - 1.4.2.Apache Ant version 1.5.4 compiled on August 12 2003Buildfile: BTSUtilityBuild.xmlDetected Java version: 1. ...

Oracle Bad link in JDeveloper download page

In http://www.oracle.com/technology/software/products/jdev/index.html page, I can't download Oracle JDeveloper 10g (Version 9.0.5.2, build 1618) because it's link (http://www.oracle.com/go/?&Src=1952635&Act=33) is not working. ...

Oracle Unable to download JDeveloper

Unable to download Jdeveloper (any version, including docs). Get page not found error. ...

Oracle cannot download Jdeveloper

Hey, Oracle ! Fix your download link for downloading Jdeveloper trial version at: http://www.oracle.com/technology/software/products/jdev/htdocs/soft10g.htmlI click the link and get a "page cannot be displayed" error. 2/18/2005. ...

Oracle JDeveloper -invalid or unknown NLS parameter value specified

I had been working with JDeveloper since version 9i, now i unzip a new version of Jdeveloper (10.1.2.0.0) but I have a problem, when i try to create a database conection and i test that conection, JDeveloper shows these error:ORA-00604: error occurred at recursive SQL level 1ORA-12705: invalid or un ...

Oracle Download Jdeveloper 10g

I can't download the: JDeveloper 10g (Version 10.1.2, build 1811)I think you guys have a broken linkAfter I Filled the Form I got this:Page not FoundI realy apreciated if u guys can send-me someinformation about it. ...

how to use ANT apache !?

i downloaded aglets 2.5 from this site : http://fluca1978.blogspot.com/2010/07/aglets-25.htmlplease read the first comment by nader 74 :Hi,I'm student. I have use Aglets2.0.2. But, when I used Aglets 2.5-alpha, I can not install the ant and I use Java_Home = C:\Java\jdk1.6.0_21 ant I have this error ...

Ant script for deploy stored Procedure

HiI try to deploy a stored procedure with the ant script created with the export button under IBM Data Studio.I have configured all files and PATH to execute thisBut when i execute the ant command : ant.bat -verbose -buildifle myfile.xmlI got an error Nullpointer Exception on DB2Version class.I try ...

problem with ant

[globus@mobilegrid3]$ ant -versionApache Ant version 1.6.2 compiled on May 23 2005[globus@mobilegrid3]$ echo $ANT_HOME/usr/local/ant-1.6.4can anybody tell me y this happens.my ant version is 1.6.4. But ant-version option displays a version which is installed with fc4.how to overwrite this?? plz help ...

How to Install and Config Ant for Centos 4.4 ?

I need to install Ant for my Centos 4.4. There is an instruction to do t by jpackage but it did not work. When I run # ant-disgnostics, the log is below. Could somebody let me know how to configure this Ant to work with Centos 4.4? Thanks!> ant -diagnostics/usr/bin/build-classpath: error: could n ...

PVCS task in ANT - not able to run from within WSAD

I try to run the ANT pvcs task from within WSAD (Right click onbuild.xml-->"Run Ant").1. This build.xml file, I placed in a project workspace (of WSAD). 2. This is the ANT task I m trying to run: <pvcs repository="S:\Wsadproj\WSWSAD~1" pvcsproject="/myproj"/>What I am expecting this to do i ...

Unable to deploy ejb with RAD 6.0 from an ANT build on Linux

I'm having troubles trying to run the 'wsejbdeploy' ANT task with RAD 6.0 on Linux (Red Hat 7.2).The ANT version is 1.6.5.This is the way I use the ANT task:<echo message="was6.dir=${was6.dir}" /><echo message="jarFile=@{jarFile}" /><echo message="tmpDir=@{tmpDir}" /><echo messa ...

CONNECTIONINTERCEPTOR_INVALID_CLASSNAME when using ant outside of IDE

I'm wondering how exactly is ant invoked when right-clicking on build.xml in a project, and running a task. When i run Rational\SDP\6.0\runtimes\base_v6\bin\ws_ant.bat -versioni getApache Ant version 1.5.4 compiled on August 12 2003But when i invoke ant from IDE, ant version is 1.6.2.So far, when us ...

Running wsadmin ant task on WP 6.1 from RSA 7.5.3

I am migrating an ant build project from RSA 7.0.x / WebSphere Portal 6.0.x to RSA 7.5.3 / WebSphere Portal 6.1.0.2 (WAS 6.1.0.21). The ant used in RSA 7.5.3 is: "Apache Ant version 1.7.0 compiled on December 13 2006"In the 'old' environment the ant build script, running inside RSA, worked fine. Now ...

Ubuntu Downgrade Ant

I've been working on a BPM for a project that I've been working on for a while, currently I'm using jBoss AS + jBPM 4.2. I have come into a few issues, mostly with usability (its for fairly computer illiterate people and I want it to be easy to use) so I've been looking into possibly using the Seam ...

Ubuntu Ant Problems

I've been trying to compile a database server (MonetDB) from source, and the compilation of the JDBC driver has been failing with the message "Bad version number in .class file" People on the MonetDB listserv suggested that this was likely a java version mismatch, and also suggested that I ...

apache ant wont compile

I am trying to compile apache ant and so far every tutorial I go through has NOT lead to a successful compile. my current environmental variables are:ANT_HOME - G:\Program Files\Apache\ant\apache-ant-1.7.1\binCLASSPATH - (empty)JAVA_HOME - G:\Program Files\Java\jdk1.6.0_16\binI just copied and paste ...

Ubuntu Cant install Apache Ant.

I try to install Apache Ant with this howto: http://osflash.org/red5/debianBut then i copy/paste this line /usr/local/ant/bin/antin this folder: /red5-trunk, then come this error:root@kotiservu:~/red5-trunk# /usr/local/ant/bin/ant Buildfile: build.xmlclean:[delete] Deleting directory /home/marbo/red ...

Oracle Database Lite and JDeveloper / ADF

I'm planning to create a small application which will run on mobile PC in an off-line mode, having synchronization with master DB once connected to the proper network.The main architecture on the target PC may be :- Oracle Lite- GlassFish- ADF applicationI downloaded JDeveloper 11.1.1.3.0 and the la ...

Ubuntu Ant problems - ignores 'delete' task?

guys - just doing some work for an exam tomorrow. I'm toying around with ant via the terminal (normally juse let the IDE do the work - but for this exam I have to be familiar with ant being used from the command line), and I'm running into one pretty annoying problem.When I use the 'delete' built-in ...

Ubuntu install apache-ant

I tried installing apache-ant.root@Jovemac:/home/jothivel# ant -versionApache Ant version 1.8.1 compiled on October 13 2010root@Jovemac:/home/jothivel# which ant/usr/bin/antroot@Jovemac:/home/jothivel# antBuildfile: build.xml does not exist!Build failedroot@Jovemac:/home/jothivel#Please help me in b ...

Oracle FileNotFoundException in JDeveloper

again , now I have a problem with a jasper file I have created a package with the name: "myreports" on the Project View-Controller, and added a jasper file to run the report through a button that is linked to a Bean in adfc-config file, So far so goodTurns out that when I copy a new jasper file to " ...

how to get the application version

HelloIs it possible to get the application version with scripting ?I can get the version from the MANIFEST.MF under WAS_IntallRoot/Profiles/Profile_Name/InstalledApp/applications_name.ear/META-INF Manifest-Version: 1.0Project-Version: 5.3.2Created-By: 2.3 (IBM Corporation)Build-Tag: V3R2Ant-Version: ...

Ubuntu setting JAVA_HOME, ANT_HOME and PATH

I try to follow this: http://cmusphinx.sourceforge.net/sphinx4/#how_build and they say "Set your JAVA_HOME, ANT_HOME and PATH environment variables as described above.". I don't see any "description above". Above it is only written how to unpack files and where to download those ...

Issues with getting local copy of jquery 1.3.1 to build from fresh SVN checkout

I checked out the branch http://jqueryjs.googlecode.com/svn/tags/1.3.1I don't have "svn" on my machine (I use TortioseSVN instead) so thebuild.xml lines that run svn to check the version of SVN crashed on mymachine. A simple commenting out fixed this.I noticed that the version.txt file ...

"build.xml:65 .. /build/dist/jquery-ui-1.8pre/headers/${target}.js does not exist. "

list,I'm trying to follow the development of jQuery UI but I'm having sometrouble building things with Ant. Here is the full error message afterinvoking 'ant' in the build folder:/home/lnostdal/programming/javascript/jquery-ui-dev/build/build.xml:65: File /home/lnostdal/programming/j ...

Java jar

I am having great trouble trying to make this program run by a double click from windowswhen I do double click on it nothing happens but when i go to the processes for windows I can see that javaw is running and is like 8000K big but nothing pops up on the screenI have tried a test program just a si ...

Problems Deploying

I am having great trouble trying to make this program run by a double click from windowswhen I do double click on it nothing happens but when i go to the processes for windows I can see that javaw is running and is like 8000K big but nothing pops up on the screenany ideas?My Manifest looks like the ...

Error trying to depoly WAR file

I'm using eclipse plug-in for WASCE. However, i can't depoly my application.This is my errors:ERROR Deployer Deployment failed:org.apache.geronimo.common.DeploymentException: Manifest class path entries must end with the .jar extension (J2EE 1.4 Section 8.2): module=../at org.apache.geronimo.deploym ...

RAD 6.0 under Vista (Yes, I know...)

I know Vista is not a supported OS for RAD 6.0, but Ive been forced to install on a Vista machine to deliver a class. For the most part the install appears OK, but there are several anomalies that I hope someone else may have seen.1. I am unable to apply the 6.0.1 or 6.0.2 refresh packs even after u ...

RSA 7.5.5 unable to open a MANIFEST.MF

My RSA 7.5.5 is unable to open a MANIFEST.MF file whose content is:Manifest-Version: 1.0Ant-Version: Apache Ant 1.6.5Created-By: 1.5.0_11-b03 (Sun Microsystems Inc.)Premain-Class: net.sourceforge.sizeof.SizeOfDoes RSA recognize ‘Premain-Class’ entry in MANIFEST.MF files?Does somebody know what c ...

Ubuntu need help in installing java jdk

I installed sun-java6 jdk and ant from the Synaptic. the result is ant is not working properly:ant -versionUnable to locate tools.jar. Expected to find it in /usr/lib/jvm/java-6-openjdk/lib/tools.jarIs that because I installed a wrong jdk?I tried to search out where is the tools.jar, I got this:loca ...

Oracle JAZN LDAP

I'm trying to get the sample application (callerInfo) working provided within JAZN LDAP for authenication and authorization. This application is provided as well with the JDeveloper 903 version. Has anyone got this to work? I'm encountering a problem when validating the userid/password. How is the " ...

Practice exercise Help!

I cant seem to find the problem with this program I am building as a learning exercise. I am getting errors referenced to extremely simple pieces of code. In the output the first thing that should be printed is the random double number that the program selects then it should print the int conversion ...

Oracle Deploy Java Classes to the Database

I am on a Oracle 10.2.0.2 database. I have no previous experience with Java and started using the JDeveloper 11g version. I have created a sample java class and when I am trying to deploy the code from JDeveloper, I get the following errors.My Database connection works and the schema HR also fine. T ...

Oracle ORA-30625: method dispatch on NULL SELF argument is disallowed

While calling a PLSQL Webservice in another PL/SQL block through UTL_HTTP I am getting the following error:ORA-30625: method dispatch on NULL SELF argument is disallowedORA-06512: at "SCOTT.SOAP_API", line 101ORA-06512: at "SCOTT.SOAP_API", line 148ORA-06512: at "SCOTT.GET_CODE_FROM_CITY", line 38OR ...

Oracle ORA-30625: method dispatch on NULL SELF argument is disallowed

While calling a PLSQL Webservice in another PL/SQL block through UTL_HTTP I am getting the following error:ORA-30625: method dispatch on NULL SELF argument is disallowedORA-06512: at "SCOTT.SOAP_API", line 101ORA-06512: at "SCOTT.SOAP_API", line 148ORA-06512: at "SCOTT.GET_CODE_FROM_CITY", line 38OR ...

Ubuntu Java: the .class runs, but the .jar does not

Okay, I have a tangled JDK because of my AMD-'buntu.1. Using NetBeans... I create a hierarchy which creates the package.unit line at the start of each source file:fuelcost.dbfuelcost.guifuelcost.imagesWorks fine in NetBeans (and I copied the /images directory over into the build). My program will ru ...

Ubuntu Java Classpath problem

I have created a jar(test.jar) that relies on a third party library(jgraph.jar). My test.jar has the following manifest:Manifest-Version: 1.0Ant-Version: Apache Ant 1.6.5Created-By: 1.5.0_11-b03 (Sun Microsystems Inc.)Built-By: ubermikeMain-Class: org.ubermike.TestJGraphClass-Path: jgraph.jarWhen I ...

Oracle ADF Security , Policies, task flows problems.

I have a problem with the application policies.I created a Loggin_page.jspx page , index_usuario.jspx page , and 2 BOunded task flow. In the index page I put 2 buttons linked to 2 bounded task flows. ( All this in a UNBounded task flow 'adfc-config', draggin and dropping the task flow on the "adfc-c ...

Oracle com.jcraft.jsch.JSchException: java.net.ConnectException: Connection refuse

I need to use ant to deploy local adf ear files to a remote windows 2008 server. I use scp to copy local ear files to remote machine. I add jsch-0.1.44.jar to E:\apache-ant-1.8.2\lib and E:\Jdeveloper_11120\jdeveloper\ant\libPort 22 is free on local and remote machine. I disable firewall of local an ...

Oracle Essbase server not starting 11.1.2.1

I am trying to start Essbase from command prompt & it's not getting started it gives me following:D:\Oracle\Middleware\user_projects\epmsystem1\bin>startEssbaseSat 04/30/201110:38 PMStarting Essbase.propertiesA subdirectory or file D:\Oracle\Middleware\user_projects\epmsystem1\diagnostics\log ...

Oracle Issue when SelectOneChoice is used with Domain data type in JDev 11.1.2.0.0

I am facing one issue while working with SelectOneChoice along with Custom Domain data type. Sample app to simulate the issue is available at http://www.filejumbo.com/Download/6FDF6ECF2922BD24 Issue Details. Base view object’s attribute is of type CustomString, for which another static VO’s attr ...

problems with distributing java applciation

I'm having some problems which I hope you could help me with. I just finished my first desktop application in netbeans, and now I would like tot est it on another computer. The application uses also other .jar files (libraries). I found some instructions on the internet on how to make an executable ...

Oracle af:tree with command link

am using jdeveloper 11g version 11.1.1.5.0 - adfbc components - oracle db 10g.am trying some examples regards,af:tree with commandLink, here what i did:i achieved the af:tree with the help of some association between two tables and then i exposed in ui,you can see in this pics1 :http://www.4shared.c ...

war task add folders that be should avoid/ignore it

i have a problem with ant war taskmy build.xml are located inmyappWEB-INFbuild.xmlthis is my war task target<target name="war-creatror"><war basedir="${basedir}/../" destfile="myapp.war" webxml="web.xml" ><fileset dir="${sourcedir}" ...

Java jdbc problem with PL/SQL package function

Good day, I have problem with Out parameter.Function in PL/SQL package:function submit_eclaim(session_id in number, claim in clob) return xmltype; Java class:public XMLType submitEclaim ( java.math.BigDecimal sessionId, String claim) throws java.sql.SQLException { .......... .......... stmt = conn.p ...