Ubuntu Installation CD - Error 1000/2000 Reading Sector Error

there. I'm kind of new to Ubuntu... well Linux in general so please forgive my noobyness (if thats a word...)Well today I just burned the ISO file onto a CD-R using Windows 7, I made sure it was working and booted correctly on my main computer. The reason I did this is because I'm trying to format m ...

Ubuntu GRUB predicament

ok, sit up straight cause this is going to take a while.i used WUBI to put Ubuntu on an SD card. i ran it off that for a while, and keeping my Vista. then i tried upgrading to to 10.10. there was even a special installer for GRUB in the process.that's when the problem started. after my comp finished ...

Ubuntu studio disc boot probelm

i recently downloaded ubuntu-studio 10.10 and am trying to boot with the disc I made from the iso i downloaded, but i keep getting the errorEDD: Error 8000 reading sector 125ERROR: No configuration file foundthen the booting process stops and I have to restart my computer.does any one know what this ...

Ubuntu GParted help required; Error while reading block at sector 142257725

I've been trying to re-arrange the partitions on my hard drive. I tried to move /dev/sda5 to the right, so that I could pull an empty (unformatted) partition out of my Ubuntu extended partition.It worked until a certain stage, when the process halted.I have the details copied and pasted below. Pleas ...

Ubuntu Input/output error when reading from CD

I'm trying to convert an audio CD to an ISO image, but all my attempts run into a brick wall. I'm beginning to suspect that this might be a kernel bug.The following happens on an Intel i7 system, running an up-to-date Ubuntu Karmic, Desktop Edition, 64-bits. My kernel is 2.6.31-16-generic.My DVD-RW ...

Ubuntu I/O error, dev sr1, sector 765768

I'm a WinXP SP2 user and have recently installed Ubuntu 8.10 as a dual boot option on my computer. The first few days went fine but then I started getting the following messages while booting into Ubuntu :sr 3:0:0:0: [sr1] Result: hostbyte=DID_OK driverbyte=DRIVER_SENSE,SUGGEST_OKsr 3:0:0:0: [sr1] S ...

usblp.c: error -2 reading from printer

I have HP printer(LaserJet 3030) connected through Samba network for windows machine.Printer is working fine, but everytime I print(from any machine) I see following commands on server, and screen is getting flooded with these messages. Printer is able to process print command and print pages.driver ...

Ubuntu 10.04 LTS crashes: end_request: i/o error, dev sda, sector XXXX

Hi, I just installed the new LTS version but it crashes sometimes an gives the error end_request: i/o error, dev sda, sector XXXX in terminalMy PC was working just fine when I was under Karmic.I think it's a bug....I run Ubuntu 64 bit on my Pentium D820 machine:HD: Maxtor PATA 160GbMB: MSI 7387GC: M ...

Oracle SCLS error 1 reading userid using clscfg command

I am executing the above line in order to populate my local.ocr file:clscfg -local -o C:\oracle\product\10.1.0\db_1 -l NAHowever I am receiving the following error: SCLS error 1 reading userid.Internal Error Information:Category: 1234Operation: scls_idq_get_user_idLocation: LookupAccounOther: Lookup ...

ubuntu 9.04, System Halt Problem <I/O error, dev sda, sector XX>

This problem annoys me much as its randomized feature makes works stop unexpectedly.The problem has features like:1) Except the mouse pointer and the application opened [tech. say, the application already loaded into the RAM], other procedures and processes are not available as soon as rebooting.2) ...

Ubuntu end_request: I/O error, dev hda sector

I've been having hard drive problems since a long time now (previous messages posted by me) and I could cope with it by using fsck and forcefsck and booting with the ubuntu's recovery mode version.the hard drive started ticking again, so I turned it off for a while and I tried turning the computer b ...

Ubuntu Upgrade to 10.04 DOA: 'end_request: 1/0 error, dev sr0, sector 0'

Pressing 'enter' makes no difference. Stops at boot with 'n' number of these errors (big 'decimal' number shown is the last one before the hang): [ 64.600448] end_request: 1/0 error, dev sr0, sector 0The message 'init: ureadahead-other main process (733) terminated with status 1' (or sometimes 'stat ...

Ubuntu end_request: I/O error, dev sr0, sector...

I just upgraded to 8.10 using the Synaptic Package Manager. I'm getting the following error when I boot with a disk in the CD/DVD drive. end_request: I/O error, dev sr0, sector 216176Buffer I/O error on device sr0, logical block 54044The following is an excerpt from kern.log:Nov 2 07:15:00 Melchior ...

Oracle ORA-19587: error occurred reading 16384 bytes at block number 1

I am getting the following error after I run rman hot backup.RMAN-00571: ===========================================================RMAN-00569: =============== ERROR MESSAGE STACK FOLLOWS ===============RMAN-00571: ===========================================================RMAN-03009: failure of del ...

Ubuntu end_request: I/O error, dev sr0, sector 0

I freshly installed Ubuntu 9.04 from alternative cd image. (REASON: EXT4 and cryptsetup LUKS)Since installation Im not longer able to write images to cd or read written cds. :-(I was searching thru forum sites, but all time answer was check scsi cable or change cd writer.Attached a log extract what ...

Oracle Error while reading data through External Table!!!

CREATE TABLE "COGNOS"."EXT_COGNOS_TBS9_TEST" ( "ITEM_DESC" VARCHAR2(200 BYTE), "EXT_CODE" VARCHAR2(20 BYTE), "RC_DATE" DATE, "RES_KD_AMNT" NUMBER(18,3), "RES_FC_AMNT" NUMBER(18,3), "NRES_KD_AMNT" NUMBER(18,3), "NRES_FC_AMNT" NUMBER(18,3), "TOTAL" NUMBER(18,3), "OF_WHICH_OVR1" NUMBER(18,3)) ORGANIZAT ...

Ubuntu Error in reading symbolic link, skipping "Reconstructor"

I am trying to make a custom livedvd, and i keep getting Error in reading symbolic link, skipping...: No such file or directoryAny one with some insight? ...

Ubuntu vnc4server - ReadExact: Socket error while reading

So, I've been using the downgraded Edgy version of vnc4server.I can find lots of posts about problems with vnc4server and ubuntu, but none of them seem to mimic my problem. Everyone else seems to get the gray, desktop-less window. I've seen recommendations to use different vncservers that don't allo ...

Ubuntu Uncompression error -- System halted

I'm trying to install from the live cd of ubuntu 10.10 the ubuntu linux and i try everuthing i know and it doesn't work...I put the cd, and it start reading it, and it gives me this message"Initializing gfx codegraphics initialization failederror setting up gfxbootboot:loading bootlogo...edd: E ...

Ubuntu Remastersys error

Im trying to make a custom LiveCD using Remastersys and im having some problems. Using the "dist" option, I made an iso file and burned it to a dvd-rw. I put the disk into my Windows system (changed the BIOS to boot CD first) and when it boots it gives me this error...EDD: Error 3200 readi ...

Computer Keeps rebooting

I have an old computer that I am trying to install Ubuntu to. It is 10 years old and my dad made it for my older brother.It used to reboot sometimes when I did certain tasks, for example when I was trying to play video game.. etc., but I haven't used this computer for a while now.But now when I try ...

Ubuntu Problems Installing 11.04

I created a boot disc (USB drive) with Ubuntu 11.04 and tried to install it on my Gateway GT5012 desktop running Windows XP. It gets to the part where I can "Run Ubuntu from this USB," and I select it. The screen shows "loading vm/linuz..." or something like that, and then the en ...

Error in Reading Text file in VC++ 2008 expression edition

I have writen a C++ program to read 37 text files. The content of the text file is interger numbers. The program was working fine in VC++ 6.0. Now i could not find the free version of VC++ 6.0. I downloaded the free version of VC++ 2008 expression edition and run the same code which was working fine ...

Error while reading hard disk mbr through absread()

I am accessing MBR to get the first 512bytes from hard disk by using absread() function in C programming.But it is showing error: "you are executing a program which directly accessing the hard disk and it works improper. Close to terminate the program". If i ignore that then it is not read ...

Validating sequential files: Error in reading files with ReadSeq statement

I have an integration process to undertake in Datastage 7.5.3 (server)I have a sequential file which i first need to validate thus to be sure that it has the exact requisite number of columns, the correct separator etc. To the best of my knowledge this would strictly fall outside the scope of Datast ...

Error in Reading Text file in VC++ 2008 expression edition

I have writen a C++ program to read 37 text files. The content of the text file is interger numbers. The program was working fine in VC++ 6.0. Now i could not find the free version of VC++ 6.0. I downloaded the free version of VC++ 2008 expression edition and run the same code which was working fine ...

Oracle Error in reading the mails from POP3 server

I am reading mails from the POP3 server using UTL_TCP package. I am able to retrieve .txt & .doc attachments successfully. I am facing an error when I try to retrieve an attachment with a very long name (irrespective of the file type). Also, I am unable to retrieve .docx, .xls, .xlsx file types. ...

Oracle I/O error while reading file

heyI am getting I/O error in alert.log file .I have posted alert log below. Thu Jul 31 10:44:51 2008Errors in file /u04/oracle/devdb/9.2.0/admin/DEV_test/bdump/dev_smon_1749098.trc:ORA-00604: error occurred at recursive SQL level 1ORA-01115: IO error reading block from file 11 (block # 31)ORA-01110: ...

Ubuntu 7.10-->I/O error, dev fd0, sector 0 with 2nd HD connected

I am trying to set up a dual boot with windozeXP and I want to place Ubuntu on the 2nd HD but when I have it connected I get...udevd-event [2357]: run_program: '/sbin/modprobe' abnormal exit...BusyBox v1.1.3 (Debian 1:1.1.3-5ubuntu7) Built-in shell (ash) Enter 'help' for a list of built-in commands ...

Ubuntu Gusty--> "I/O error, dev fd0, sector 0" with slave hdd connected

I posted this in the newbie forum but i'm going to see if I can delete it from there, maybe this is a better place to get a response...I am trying to set up a dual boot with windozeXP and I want to place Ubuntu on the 2nd HD but when I have it connected I get this error:udevd-event [2357]: run_progr ...

Error by reading a xml file

I've written a code, that should be reading xml with js. But I have make an error. Can you help me?<html><head><title>Test</title><script type="text/javascript"><!--var http = null;if (window.XMLHttpRequest) {http = new XMLHttpRequest();} else if (window.Ac ...

Error in reading file

I have made a .txt file in a format that it contains data per line i.e. in the format /*text1*//*text2abc*/And its not defined that how much data it can contain per line.I am reading this file in a per line format basis using this codeCStdioFile ptr;CString str;int i = 0;ptr.Open(file_name, CFile::R ...

Nmon consolidator v1.1.0 gives a VisualBasic-error when reading the csv-file data

I am trying to run the nmon consolidator, but Excel failes with an error.See the attached file. Please assist me with this problem.We are using: MS windows XP (Netherlands/Dutch version) MS Excel 2002 SP2 (Netherlands/Dutch version) Nmon consolidator version 1.1.0 Nmon on AIX version v11e ...

Compile error when reading from file

all... Ive only just started playing around with C, but I'm getting an error when trying to read a file.Im getting this line 1 error:1 C:\Dev-Cpp\include\c++\3.4.2\backward\fstream.h:31, from C:\Documents and Settings\Matt\My Documents\test2.cpp In file included from C:/Dev-Cpp/include/c++/3.4.2/bac ...

kernel:end_request: I/O error, dev fd0, sector 0

HiI am running SuSE 9.3 on my box. I applied a kernel update patch using YaST now I get this error message when the booting sequence finishes and the login screen appears.Code: ...

[C] - filepointer error when reading a .txt file

I have a problem when reading my double array from a .txt file, the double array is a follows:4 4 2 2.0 3.0 -4.0 2.0-4.0 -5.0 6.0 -3.02.0 2.0 1.0 0.0-6.0 -7.0 14.0 -4.04.0 -8.0 9.0 6.02.0 1.0 3.0 4.0When stepping over my code in Visual C++ 2008 (after using this function call)FOPEN(fp, fileName, ...

Invalid at the top level of the document error when reading XML file

complete message is as below:The XML page cannot be displayed Cannot view XML input using style sheet. Please correct the error and then click the Refresh button, or try again later. --------------------------------------------------------------------------------Invalid at the top level of the docum ...

Error 2 Reading Header?

So I downloaded all the 4 i386 32Bit Fedora Core 4 Discs and burned them to a CD, I restarted my system and inserted Disc #1, I did 'linux mediacheck' because the install tutorial said to test all discs. The discs passed that, so they are good.I press 'enter' and start the install of Fedora, but the ...

Oracle AQ Error while reading from AQ Table using Windows Service

Code: -25215Message :ORA-25215: user_data type and queue type do not match. This is an interminent error whenever we try to change the oracle types with adding a additional element and refer as an object in the SYS.AnyDATA function. This error is coming whenver we are trying to enqueue the message f ...

Error while reading an sybase database

I have next problem: When importing in King our Sybase Database (wassen.db), a box appears with the notification:Can't perform the select of the administration Wassen. Wassen.log can't be used. It's used more recenly then Wassen.db. When you've imported a backup, you may delete this log.But, when de ...

Error while reading value from user in shell script

Below is little bit of code, which i'm unable to run,#!/bin/cshecho answer = ""echo " Please enter x to exit from script and anyother character to continue"read answerif ( "$answer" = "x" )thenecho "Exiting from the $0 script, please the error log file. ...

Runtime Error while reading a float to an array??

#include<stdio.h>#define MAX 4main(){float A[MAX];int i;for(i=0;i<MAX;i++)scanf("%f",&A[i]);return 0;}im using Visual C++ and doesnt give me any compilation error it keeps giving me a run time error after i enter the 1st number i can't figure out whats wrong help? ...

Parse Error when reading from table...Urgent

Thanks for helping me on a weekend!Here is the code i am trying to run. however i am getting:Parse error: parse error, expecting `','' or `';'' in c:\apache\htdocs\aol\adv_course.php on line 168here is the code:<?// set a variable with the database name$database_name = "test";// attempt ...

Error when reading a binary file!

I've got code sections which write and read binary files. But when I print data reading from file. It appears unnecessary characters.int WriteFile(const char* file_name){fstream file(file_name,ios.out|ios.binary);if(file.is_open()){string data_block="I don't understand!\nAdd one line";file ...

Error in reading DataReader

HiI want to read the content in datareader.So I use below coding to do thatif (dataReader4.IsDBNull(0)){}but I run above coding it gave me an error meassage.The error Meassage is "Invalid attempt to read when no data is present".then I use below codingdataReader4["Email"]==nullbu ...

Ubuntu Error in Reading Synaptic Package Manager

Recently installed Ubuntu 8.04. Having problems trying to find Korganizer in Applications system.Now when I try to get into System/Administration/Synaptic Package Manager I receive the following Error Message:E: Malformed line 56 in source list/etc/apt/sources list (dist parse)E: The list of sources ...

error in reading file

everyone, i'm new in c++ and i found a problem when created a code.I want to create a code which read from file .txt and then count the number of each value of the attribute, as the text file below: the attribute is'bembi' and the value is '1,2,3'. And i want my code return the number of the value w ...

Error while reading .prc file in Ubuntu 10.10 Maverick

How can I fix the error show in the video: http://www.youtube.com/watch?v=C5rvmmcmPDo ...

Ubuntu pcmanfm - bus error when reading CD

Pcmanfm crashes when trying to access an inserted CDsaying Bus error. However it does show the cd on the leftamong the other locations and does prompt for an action when the cdis loaded into tray.Tried the same CD on another (ubuntu-gnome-nautilus) laptopand everything was just fine. Other CD's work ...

error when reading from a directory

when i read from the 'images' directory, the script can display the file names inside the directory, but the next line displays "could not find file". anybody can help?? tia,daniel$dir = "images/";$handle = opendir($dir); while (($file = readdir($handle))){ if (($file!=". ...