Deployment from com.ibm.etools.ejbdeploy.EJBDeployer had errors: RMIC command failed on project

Deployment from com.ibm.etools.ejbdeploy.EJBDeployer had errors: RMIC command failed on project: EmployeeMasterEJB with message:error: An error has occurred in the compiler; please file a bug report (http://java.sun.com/cgi-bin/bugreport.cgi).1 errorFurther details have been recorded in the .log fil ...

RMIC command failed on project: Compiler Error?

I get the following error when I try to deploy a project. Pretty strange. I was told one solution is to open the ejb-jar.xml file for the project and that causes RAD to reread the config info, but it doesn't fix it this time. Any suggestions? This is with RAD 6.0.1.1. Deployment from com.ibm.etools. ...

DataStage Desinger Jobs Failed to open

Rececntly we compiled all the jobs and shutdown the designer and brought it back. After then, none of the Jobs were able to open in the project. This is error message we receive "This item has no design time information". I guess some files must have deleted mistakenly. I really appreciate if any id ...

DataStage - Unable to create new project

I am getting following error message while creating new projectDSR.ADMIN: Error updating secondary indices.Screen shot of the error message is attached. We are using 8.1 on AIX. ...

Error calling subroutine *Datastage* DS_FILEUTIL(action3)

I get this Error calling subroutine Datastage DS_FILEUTIL(action3) check if Datastage is setup correctly in project blabla (Subroutine failed to complete successfully(30107))Hope for any suggestions:-)/Patrick ...

Login to Datastage not as administrator

HelloI have Datastage 7.5.2 on windows XP. I created first_project during installation.I created new local user na local group on this machine. The user is not inAdministrators group.I logged as Administrator to Datastage administrator tool and for project first_project changed permissions, new grou ...

DSR.ADMIN: Failed to set entries in ACL

I've installed Datastage client and server on the same machine (windows xp) - just for test. Then I created the first project Test3, run datastage administration, selected my Test3 project and open project properties dialog window. At the permissions tab I can see a list of windows groups but I can' ...

Does DataStage TX support EDI X12 transactions?

I have a need to use DataStage TX for an integration project in a Healthcare initiative. Does anyone have information on whether DataStage provides out-of-the-box X12 templates (or XML Event Type Definitions-ETD) for transactions involving one or more of the following interfaces:a) 271b) 274c) 824d) ...

Unable to create and view Datastage Projects

I have installed Datastage 8.0 on Red hat linux system.I am able to open webconsole from client pc.But, when i am openning Administator Client, projects list are not apprearing in available projects.Also, When i am trying to add a new project i am getting error saying *'Erroe Calling subroutine *Dat ...

DSR_PROJECT Action=17

Version: 7.5.2Platform: AIX 5.3I've installed DataStage on an AIX server and, unless I'm logged in as root, I can't access the projects. If I try to open designer with a non-root user, I get this message: Error calling subroutine: DSR_PROJECT (Action=17); check DataStage is setup correctly in projec ...

Error code 39202

I have sun solaris, DataStage 6.xFailed to connect to host xx project xxInternal Error: 39202Any one knows this error? ...

Link Collector: how to ignore "finished" input sta

I have noticed a strange behaviour on the Link Collector stage.We have a Server Job with two Oracle 9i input stages that go into the Link Collector; the output ot the collector then goes to a transformer to be elaborated. Basically we are using the collector stage as a SQL Union. We are using Datast ...

Error calling subroutine:DSR_NLS (action25) check datastag

Error calling subroutine:DSR_NLS (action25) check datastage is setup correctly in project dpr_hew_tst.What I'm trying to do here is:I'm migrating data from IBM Iseries to Pseries(AIX), where my ISeries data have one Chinese column with code page 937. I'm using DB2_UDB stage to access this data and s ...

Error adding to schedule: garbage after time specification

Error adding to schedule: at: garbage after time specification(Command was: AT 09:43:43 vmdsr_sched.exe d:\apps\ascential\DataStage\Projects\Test TEST -3480)We have a new DataStage development installation on a Windows 2003 (v5.2) server and we are getting this error when trying to set the userid/pa ...

error from workbench.

I am setting up a new RSA 7.0.0.8 MDM801 workspace using workbench, the job failed at 'Prepare For Deployment' with following errors in automationLog.log file,Prepare For DeploymentStart operation prepareForDeployment Wed Feb 25 00:28:09 EST 2009ejbDeploy EJBDeploy: Project ProductServicesWSEJB (Mes ...

Deploying MDM application to WebSphere - Error

I am trying to deploy MDM application(out of Box) to Websphere server.I am getting the below error.Could anybody tell me what can be the problem? I haven't modified anything.!ENTRY org.eclipse.osgi 2 1 2010-12-29 17:15:20.483!MESSAGE NLS unused message: servicereference_to_interface_Transform_Interf ...

DB2 EE stage problem

We are using DB2 EE stage to access DB2. We have a SMP unix called as Server1 and DB2 is installed on Server2. Our jobs follow ETL methodology i.e. 1 extract job, 1 transform and then 1 load job. Now the configuration file consists of 4 nodes with fastname a Server1 and one db2 node with fastname as ...

Timeout Issues with one client

I have one developer that is getting errors such as:Error calling subroutine "DataStage"DSR.ADMIN (Action=10); check DataStage is setup correctly in project Production(The connection is broken (81002))orError calling subroutine DSR_RECORD (Action=2); check DataStage is setup correctly in project Pro ...

Timeout Issues with one client

I have one developer that is getting errors such as:Error calling subroutine "DataStage"DSR.ADMIN (Action=10); check DataStage is setup correctly in project Production(The connection is broken (81002))orError calling subroutine DSR_RECORD (Action=2); check DataStage is setup correctly in project Pro ...

Assertion error while implementing a vector

QUESTION: The prime factors of 13195 are 5, 7, 13 and 29.What is the largest prime factor of the number 600851475143 ?I was trying to solve this problem. I was previously suggested to use the "Sieve of Eratosthenes" Method to find the prime nos. http://en.wikipedia.org/wiki/Sieve_of_Eratos ...

EJBDeploy error in RSA

I tried to generate an Skeleton EJB web service from a pre-defined wsdl. The skeleton EJB code got generated with the methods(functions) taking the SOAPElement as their input/output and in-out params (SOAPElementHolder). There is no error so far, but after generating skeleton, when I try to generate ...

rmic cannot continue

I can't generate deployment code (by right cklick on the EJB project) in RAD 7.0.0.2 for WAS 6.1 for Stateless Session Beans: Whenever I declare a method (by Xdoclet - ejb-jar.xml looks fine) visible in the remote interface I get the errors listed below. If the method is visible for the local interf ...

Exception while generating EJB Deployment code after adding EJB to deployment descriptor

I receive a ArrayIndexOutOfBoundsException exception when I try to deploy the ejb code (right click ejb project, deploy).I have just added an ejb to the deployment descriptor (via the wizards).The error in the .meta\.log file is*ERROR**: RMIC cannot continueerror: An exception has occurred in the co ...

RMIC cannot continue

we have got the following problem using WAS 6.0.2.9, RAD 6, Windows XP while deploying the EJB project: **ERROR**: RMIC cannot continueerror: Class com.ibm.objectgen.fw.data.DataObject contains an invalid argument type in method hasErrors.error: Class com.ibm.de.thorone.ejb.messages.loadprocessor.Me ...

EJBDeploy Script vs. RSA 7.5.3 "Prepare for Deployment"

Why might the ejbdeploy script succeed in the deployment of EJBs, while the "Prepare for Deployment" feature of RSA 7.5.3 fails?Here's an excerpt from a RSA workspace's .log file following an attempt to "prepare for deployment" a project containing EJBs:!ENTRY org.eclipse.jst.j2ee 4 0 2009-09-22 09: ...

EJB Deployer of RAD 6.0.1.2 - NoSuchFieldError: PartnerVersion.UNKNOWN

I have run into a problem with the EJB Deployer of RAD 6.0.1.2. I receive a java.lang.NoSuchFieldError: com/ibm/CORBA/iiop/PartnerVersion.UNKNOWN when I try to deploy EJB code. I suspect that an update to the WAS test server may have broken this but I'm not sure. I have included version information ...

Error using Prepare for deployment in RAD 7.5.5.1

When doing Prepare for Deployment in RAD 7.5.5.1 on an EJB 2.0 project I get the following error (from .log file):!ENTRY org.eclipse.jst.j2ee 4 0 2010-09-29 17:33:08.484!MESSAGE Deploying partEJB!SUBENTRY 1 0 0 2010-09-29 17:33:08.484!MESSAGE Deployment from com.ibm.ast.ws.jaxws.deployer.JAXWSDeploy ...

RAD Deployment error

Has anyone had similar problems like the one below?I'm using RAD 7.0.0.8 and WAS 6.1.0.23. OS is Win XP SP3.Prepare for deployment fails on all EJB projects in the workspace, with the error message:!ENTRY org.eclipse.jst.j2ee 4 0 2009-05-05 17:30:52.668!MESSAGE Deploying HPB.Abit.Data!SUBENTRY 1 org ...

TDP Error

While building TDP,i am getting below mentioned.if you one have any suggestion,please provide.building FIDEX_TDPTEST2/Debug/FIDEX_TDPTEST2.elf#>require C:\WindRiver\workspace\FIDEX_TDPTEST\Test RealTime\Default\results/TPflags.plTestRT-I-STARTEXEC, Rational(R) Test RealTime instrumentation driver ...

New Beginning - Longhorn? Heh, that should be old news...

NOTE: When I refer to Longhorn here, I don't mean Vista's code name. I mean Vista as it was before it had its development reset to a slightly different base & had most of its new features axed. Many refer to this as, "Longhorn," since Vista was still under that code name at that time.O ...

Work Rhapsody v7.5.2 with Visual Studio 2005

We want to use Rahpsody v7.5.2 for design and modeling and use Visual Studio 2005 for coding and debug.How should I set the project Property (lib/source/...) in vs2005?I tried this way but failed:1. project Property -> Linker -> General -> Additional Library Directories, add "Rhapsody folde ...

include .lib

I am trying to include a third party library in my app. Things that I have tried and failed: In Project Settings -> Link tab -> General category, I have the full path and lib in the object/library modules. In the same tab Input category for the additional library path I have the same p ...

Ubuntu Savs the Day

I had a pretty big project due today in class, I walked into class and noticed the computer was running windows 98 (how sad), it had a wicked old version of power point on it. Needless to say, my version was not compatible with that version. Luckily, I had my flash drive with ubuntu 10.10 on it. So ...

a code page (nls)problem: Failed to connect to DataStage server?!!

When I want to connect a windows client with Chinese Lang(code page 936) to a Datastage server installed on Linux (English),I encounted the following errors:"Failed to connect to DataStage server: BI, project: UVInvalid UniVerse mark characters have been sent from the server. Code page 936 may not s ...

cannot create DataStage project on IIS 8.1

Hiwhen I tried to create a project in the DataStage Administrator, I ran into the following errorany idea to solve this ? thanks a lot !! "Errors were detected during project creation that may render project test unstable.Please contact your support provider if you encounter problems.Caused by: DSR. ...

PROJECT CREATION FAILED!? - "Operation could not be comleted"?!

Hello, I am desperatley seeking help on this HORRIBLE error I get whenever I try to create aWindows Form Application in Visual C++ Express 2008!It displays a pop up "Operation could not be completed"and in the status bar "Creating Project [name] .. Project creation FAILED"I have ...

Cannot publish because a project failed to build

I m publishin vb.net from but it give me eorors like below Error 1Cannot publish because a project failed to build. Error 2 A signing key is required in order to publish this project. Publishing from Visual Studio 2005 will automatically configure a signing key for this project. can u help me pls ...

Failed to write to project file

I have received an error message "Failed to write to project file" while trying to update properties of a project using ds administrator with admin userid and password. I was previously able to do so many times. ...

Multiple User in a Single DataStage Project

I am having multiple users assigned to multiple DS projects. The issue is all the users need to be assigned different user roles.I checked in the DS Administrator->Project Properties -> Permissions but it allows only fo Group and Users as a whole.Basically this is what i want to do:Project: DS ...

Error:Project DSS_P is not set up for Datastage use

Few days ago, one of the project work folder reaced 99% space usage and hanged.We managed to identify the issue and increased the space. The ETL batch managed to resume as normal but another problem arised.Whenever I tried logging in using the dsadm id to either Manager/Director/Designer or Administ ...

ACCESS DENIED: You do not have access to this project. Ensure that you are setup as a DataStage user

While I am trying to login to the director, designer and manager, I am facing with this error:codeACCESS DENIED: You do not have access to this project. Ensure that you are setup as a DataStage user[/code]The userid "roy" has the access to the project. I am able to connect using the dsadm password. ...

ERROR creating DataStage Project in DataStage v8, Need help!

I have installed IIS 8.0.1 redhat version on CentOS Linux, use iis user registery, mapping dsadm to a datastage user. Always get below message while the create project windows says "initializing demo files..": Error calling subroutine: *DataStage*DSR.ADMIN (Action=20); check DataStage is set up corr ...

what is the default project and default credential for datastage

I have just installed datastage version 8.0.1 (client and documentation option)When open datstage designer it asks me for domain name, user name and password and the default projectWhere can i got these information? , the installation guide said that these information will be found during installati ...

Error when import Datastage project into MetaStage

When I run a import from MetaStage with DataStage metabroker I get error ' Unable to reconcile versions'.1 create import category XX2 succesfull import DataStage project XX3 delete import category XX4 create import category XX5 not succesfull import DataStage XX. Error error ' Unable to reconcile ve ...

Corrupted DataStage project

We are currently using DataStage 7.5.1 Enterprise Edition and appear to have lost all our jobs from our project. The directories and files seem to exist on Unix. We are getting an error "check DataStage is set up correctly in project xxx"Is there a simple method of recovering this project, as we obv ...

Urgent! Can not create new project in DataStage 8,

I have installed IIS 8.0.1 redhat version on CentOS Linux, use iis user registery, mapping dsadm to a datastage user.Always get below message while the create project windows says "initializing demo files..":Error calling subroutine: *DataStage*DSR.ADMIN (Action=20); check DataStage is set up corr ...

my project allegro drawing program failed due to msvcrt.lib error pls help

1>------ Build started: Project: allegro, Configuration: Release Win32 ------1> allegro.cpp1>MSVCRT.lib(crtexe.obj) : error LNK2001: unresolved external symbol _main1>c:\users\lenovo\documents\visual studio 2010\Projects\allegro\Release\allegro.exe : fatal error LNK1120: 1 unresolved ext ...

Remote C/C++ project broken and failed to create

Does anybody experience remote C/C++ project is broken and then a new C/C++ project is failed to be created? I am using RDp version 8 installed in windows XP. IBM XL C/C++ Compiler is version 8 on AIX V5.3.When RDp is set up, it works. But, at some point, the project is failed to build. Also new pro ...

project creation failed

i have installed vs 2005 on windows 7, it worked fine for few days but suddenly while creating new website project i got error "creation project<projectname>...project creation failed".Also when i try to run existing projects another strange error i encountered was"Unable to con ...

PROJECT CREATION FAILED!? - "Operation could not be comleted"?!

Hello, I am desperatley seeking help on this HORRIBLE error I get whenever I try to create a Windows Form Application in Visual C++ Express 2008!It displays a pop up "Operation could not be completed"and in the status bar "Creating Project [name] .. Project creation FAILED"I have ...