Ubuntu Aion Graphic Error BAD - White Smoke

I can get Aion to start up, login, and even enter my character, BUT i get this weird white box/smoke/cloud which effects my whole screen. I have tried changing the environment of wine, change some of the settings within Aion, and tried emulating Desktop with Wine. AND after tweaking and trying to ru ...

Problems with includes

I am having problems compiling a dll.The problems seems to stem from not getting the right includes.Does order of includes matter?The ADSIAuth.h is generated by javah.The include that are in my code are:#include <stdio.h>#include "ADSIAuth.h"#include <iostream>#include <wind ...

cvEyeTracker install errors

I'm trying to install cvEyeTracker but I'm getting some strange problems. I was in general help before but after being very informative Segfault concluded something mysterious is going on and suggested that I go to the people who know everything."I'm not a programmer, IMO this means the program ...

Ubuntu Cannot make cyrus sasl

I'm trying to install cyrus-sasl version 2.1.23 in Ubuntu 8.04.1 for use with sendmail 8.14.2 user authentication. I ran configure which seemed to go okay, however making it ran into a few cryptic (to me) problems resulting in Errors 1 and 2. # ./configure --enable-login // if you know any other fea ...

Ubuntu dvorakng: need help to install

I really need help to install this typing tutor. I search in google and in the forums, but nothing...You can find dvorakng here:http://freshmeat.net/projects/dvorakng/the readme is very simple, I follow the suggestions but I can't install it. Someone can help me?Here the error output:$ makeg++ -g0 - ...

Ubuntu Need Help Installing KWorld PlusTV USB 315U

Wow, got to say I love Ubuntu (Linux). I just wish I had the same knowledge base on it as I do in Microsoft. I am totally new to Linux and Ubuntu and it's like pulling teeth for me to get around in it. I'm a total dweeb newbee.I am slowly but surely getting my system up and running. I am currently t ...

Ubuntu need help using a makefile

I have been trying to install avview from the source and I have used ./configure and after great pain have managed to get it to create the makefile. Now however I cannot get it to compile. Here is a log of the error I get.make all-ammake[1]: Entering directory `/home/ryan/Desktop/avview-0.80.7'if gc ...

Installing US Robotics 9000 in Ubuntu

I am a total noob with Linux and am just getting to grips with it. I cannot seem to get the drivers to compile for this modem. This is the errorfrom /usr/include/linux/module.h:9,from AdiUsbAdslDriver.c:32:/usr/include/linux/time.h:9: error: redefinition of ‘struct timespec’/usr/include/linux/time ...

Ubuntu Nightmare attempting to compile Gnofract4d-3.3

alternative title : How to install Gnofract4d in 72 hours (or more)i usually don't post on forums, but i feel the time has come for me to be the stupid noob asking a horrible question. (Preliminary note : i have followed various other forum suggestions and the official site for Gnofract4d - all with ...

Ubuntu Compiling yatm-0.4 - what's going wrong?

I'm getting that sinking feeling: I tried to compile this neat little utility to speed up or slow down an MP3 or OGG file a while ago, got it running, and hosed my network connection at the same time, possibly with a rogue kernel up-/down-/sideways-grade which I still don't understand.Since re-insta ...

Ubuntu make and driver installation

I have a serial to usb adaptor and it came with linux drivers but I have no idea how to use them.When I run make I get the following messages:keithclark@keithclark-desktop:~/Documents/ftdi_sio$ makegcc -Wall -D__KERNEL__ -DMODULE -I/lib/modules/2.6.27-7-generic/build/include -D__SMP__ -DSMP -DMODVER ...

Ubuntu (EE) fglrx(0): [agp] unable to acquire AGP, error -1023

is there a fix for that problem and these(EE) fglrx(0): === [swlDalHelperAddCustomizeMode] === CWDDEDI_DisplayGetSetModeTimingOverride failed: 7(EE) fglrx(0): === [swlDalHelperAddCustomizeMode] === CWDDEDI_DisplayGetSetModeTimingOverride failed: 7(EE) fglrx(0): === [swlDalHelperAddCustomizeMode] === ...

Error Message I Can't Solve Related To Extracted File Location - VC++ & wxWidgets

I keep getting the error message in the image below after successfully running the program I have compiled:http://i252.photobucket.com/albums/hh7/folderforimagestorage/Error.pngThe file mentioned in the error message was extracted from the RGSSAD archive successfully and is at the location mentioned ...

Ubuntu startx error: ddxSigGiveUp: Closing log

I'm having a problem with my X server. I'm trying to launch ratpoison with the command 'startx ratpoison'. However, it fails with the following output:X.Org X Server 1.7.6Release Date: 2010-03-17X Protocol Version 11, Revision 0Build Operating System: Linux 2.6.24-27-server x86_64 UbuntuCurrent Oper ...

bitvector32 error

I am receiving a 'Cannot convert type 'bool' to 'int'" error, while using BitVector32.Section. I am trying to make ints, not booleans. I used this previously in the same way and it worked. Here is my code. I am passing it an Int32. Thank you for anyone who can tell me why I am receiving this er ...

Oracle workaround for 1023 byte limit in utl_file

I am looking for a work-around for the 1023 byte limit in PL/SQL's utl_file.put_line.Here's what I need to be able to do :I need to extract all columns out of a table into a file. Two of the columns are varchar 2000 bytes. I am using utl_file.put_line to write out the record to a file.I get a SQLCOD ...

Compilation Error VC++

While compiling a VC++ 5.0 code in VC++ .NET 2003, I get the following error______________________________________________C:\Program Files\Microsoft Visual Studio .NET 2003\Vc7\atlmfc\include\cstringt.h(875) : error C2664: 'PtrToStringChars' : cannot convert parameter 1 from 'unsigned char *' to 'co ...

MsDev DEBUG error on pointer 0x00000001

I am attempting to debug existing code where a list of doubles is created as:const HIGH_RANGE = 1023;int variableSize = <<some valid low int>>myList[ variableSize + 1]The variableSize has been validated, and is in a proper range between 0 and HIGH_RANGE.I delete the list by the line:if ( ...

Ubuntu Hard-drive crash - repeat with error sign

can any help with this? This is the second time my hard-drive has been corrupted. I am pretty newbie so need full instructions. thanks!- jaredOS: Ubuntu 10.04Laptop: Dell M1330 Issue in December 2010:My laptop running 10.04 will no longer boot. The day before, it wouldn't mount my USB flash but I fi ...

Ubuntu Hard-drive crash - repeat with error sign

can any help with this? This is the second time my hard-drive has been corrupted. I am pretty newbie so need full instructions. thanks!- jaredOS: Ubuntu 10.04Laptop: Dell M1330 Issue in December 2010:My laptop running 10.04 will no longer boot. The day before, it wouldn't mount my USB flash but I fi ...

Ubuntu GParted error: ext3 filesystem indicated as swap

I just got a new hard disk so that my "/" and "/home" partitions would be located at their own separate drives. All was well until i tried to expand my "/home" partition to fill up the entire drive that used to also have the "/" and swap partitions on there. L ...

Ubuntu Unzipping problem | write error (disk full?)

I have a problem with a redhat machine, I'm asking in a redhat forum, but no solution for the moment, I don't know if theres much difference between ubuntu and redhat, but I'm posting my problem here hoping you can help me.I have a strange problem unzipping a file. I think is a problem of memory or ...

Ubuntu Grub error after reboot

PROBLEMHi, I have problems with Grub. When I reboot the computer, the Grub menu does not show up, instead Grub throws an error (15 I think). Sometimes (after several "reboots"), it succeeds in building the grub-menu, but then it can't boot any entry, it says something like "Bios cant ...

Oracle ERR-1023 ???

A shot in the dark but has anyone ever received this error message? Error ERR-1023 Unable perform validationsAlso received ORA-06502: PL/SQL: numeric or value error: character string buffer too smallUsing ApEx 2.0.david ...

Cpp program error...

I'm geting a error in a small program I'm trying to get to work.// Program #2 - Using a variable#include <iostream>int main(){int x; //this declares a variablex = 1023; //this assigns 1023 to xcout <<"This program prints the value of x:";cout << x; // This displays 1023re ...

Ubuntu Dual Boot: BIOS 1023 Problem???

I have installed Ubuntu 5.04 on my second Hard Drive. My first HD contains windows.When i make my 2nd HD as boot device, i see GRUB Menu (i.e. stage 2).On trying to boot Ubuntu, I get an Error 15: File missing problem. The FS shown was FAT.On trying to boot Windows, I am presented with the GRUB Menu ...

Compile Error - can't assign to array

I used the following code to communicate with a device.getting compile error like "Can't assign to array" Why? anyone can help me to solve this?HanneSthEGreaT, I used the same code that u've given to me with slight modifications.May i know what'll be the pbm here?Private strInBuff As Strin ...

Ubuntu Error Burning DVD-R

I'm having some trouble burning DVD-Rs with Ubuntu 9.10. I've tried Brasero, Gnomebaker and Xfburn, but they all fail. Below is the output from dmesg and Brasero (sorry they're rather long - I wasn't sure what parts would be pertinent).I'd really appreciate any help - this is driving me bonkers!dmes ...

Oracle Error while running UploadDownload Sample of developer's kit

I tried running the sample program(UploadDownload) and getting an error:UploadDownload: startingChecking for existance of sample5.doc ...sample5.doc does not exist - uploading ...java.lang.RuntimeException:java.lang.RuntimeException: Unknown exception. See cause.java.lang.RuntimeException: Unknown e ...

No Screen Found Error - Kubuntu 9.04 / 9.10

I've installed Kubuntu 9.04 on my Sony Vaio VGN-C2Z notebook with GeForce Go 7400 GPU a few days ago after having tried it for a while as live-OS. When I was using it as live-OS it automatically configured the resolution correctly, but when I tried to install it it didn't start the X-server, so I ha ...

.NET Runtime error in windows service

I created one windows service using vb.2005 which is keep sending and receiving command from one system and executed in another system using serial port.Which was working fineSome time, i am getting 2 .NET Runtime 2.0 Error like thisError 1:-Event Type: ErrorEvent Source: .NET Runtime 2.0 Error Repo ...

Ubuntu how to fix? Error #113: Primary partition overlaps previous partition.

I have dualbot, linuxmint 4 (ubuntu based right?) and windows xp on my notebook. Yesterday I want to replace linuxmint with Ubuntu one. But when it asked the partition, it seems GParted cannot detect the Windows or other partition. It just said that there are unlocated partitions (so my disc is all ...

Ubuntu Error Formating External Hard Drive

I recently got a 300gig seagate hard drive in ntfs, so I decided to format it to ext3 with gparted on hardy heron.Whilst formatting, an error popped up, and after exiting, the HDD disappeared completely . To make it re-appear, I've been constantly restarting the computer, and it sometimes shows up. ...

Ubuntu iwl3945 error & froozen desktop.

Hi, I have a dell inspiron 1525 (ubuntu pre-installed). Now I have problems with the iwl3945. First of all I can connect and I can open firefox (or another browser), dmesg says:[ 842.081963] wlan0: Initial auth_alg=0[ 842.081973] wlan0: direct probe to AP 00:b0:0c:02:18:9c try 1[ 842.084603] wlan0 d ...

Oracle utl_http does not give a very helpful error message: Invalid Parameter

I'm writing PL/SQL to consume a web service on another server. In trying to execute this snippet of code, I receive this error:ORA-28783: Invalid parameterORA-06512: at "SYS.UTL_HTTP", line 1023ORA-06512: at line 29Line 29 is the utl_http.begin_request statement shown below.I'm baffled as to what th ...

Ubuntu Wireless Drops, Crash Report says "Serious Kernel Error"

I have Ubuntu 9.10 installed on kernel 2.6.31-14-generic x86_64 and completely up-to-date as of the time of this posting. My wireless card is recognized and does work for about 10 minutes at a time, but then it will drop connection, and I get a Crash Report as network-manager reconnects me. I'm real ...

Oracle Error in date validation

Situation:The form has fields likestart date : P1_ST_DTend date : P1_END_DT and other fields for search.& If i press a button "P1_GO" the report will get executed.My report goes like this:SELECT ret_button_fn("CON_ID") "CONTRACT ID", "V"."SI_NAME" "SITE NAME","V"."GR_NAME" "GROUP NAME", "V"."CL_ ...

query hints maximum command buffer size of 1023 bytes

I have an error that say's query hints maximum command buffer size of 1023 bytes. I've already researched on the web and found two solutions: first is to create and stored procedure and second is to create a view. Unfortunately I can not apply this two solutions because I'm not allowed to make chang ...

Oracle getting error with inserts

HiI’ve written a procedure in which I insert rows in respective columns in a table.One column say “TEST” in that table have datatype as varchar2(1024 char)I’ve done 5 unions to accomplish this task.In two blocks, I have written like Primary_key, substr(source,1,255) as TESTfrom joins of diff ...

query hints maximum command buffer size of 1023 bytes

I have an error that say's query hints maximum command buffer size of 1023 bytes. I've already researched on the web and found two solutions: first is to create and stored procedure and second is to create a view. Unfortunately I can not apply this two solutions because I'm not allowed to make chang ...

Oracle Error: org.xml.sax.SAXParseException: <Line 1, Column 2049>: XML-20100:

While trying to run HelloWorld Program provided by devkit..... we ended up with following error: HelloWorld: startingjava.lang.RuntimeException:java.lang.RuntimeException: Unknown exception. See cause.java.lang.RuntimeException: Unknown exception. See cause.at oracle.ifs.fdk.client.impl.AxisRemoteMa ...

Oracle ERR-1023 Unable perform validation - On a SQL Expression

I have a validation process which looks if the colum TOTAL_HEURES > 8 on the current record of the table FICHE, on a master/detail form. This validation is not associated with an item. The validation method is a SQL expression. it is conditional of course if the item P42_FICHE_ID is not populated ...

Oracle Change of Date Picker format causing ERR-1023 Unable perform validation

I have a page that up until now, has a date picker of format DD/MON/YYYY which when commited, saves the date to a database table field.I tried to modify it to date picker format DD/MON/YYYY HH24:MI, however when I enter the date from the picker as DD/MON/YYYY HH24:MI and commit, I get the following ...

Ubuntu Error in NTFS Partitions after Forced Shutdown

I need help trying to correct some errors in NTFS Partitions i have making them not automatically mountable in Ubuntu start and preventing me totally from booting into windows xp .Thanks in advance :)MY HDD :C fat32 ~16 GB , D NTFS ~27GB , E NTFS ~38 GB , G NTFS ~19 GB , linux ext3 ~9 GB , swap ~2 G ...

Oracle error while installing on XP

everyone , today i when i try to install 10gR2 on windows Xp machine it shows me this error when installtion is 78% completeerror is:The value of environment variable PERL5LIB is more than 1023 characters.The value can not be set. thanksEdited by: Shrma on Dec 20, 2009 10:57 PM ...

Oracle ORA-01686: max # files (1023) reached for the tablespace

I got the below error.SQL> alter tablespace obtts2 add datafile '/apps/data01/data/ts2/data_ts2_1489.dbf' size 10m autoextend on*ERROR at line 1:ORA-01686: max # files (1023) reached for the tablespace OBTTS2I find the below solution:Error Message: ORA-01686 max # files (string) reached for the t ...

Ubuntu ERROR 18(can you uninstall grub)

I have a dell 1.7 GH pent 4After installing i get this errorGrub loading stage 1.5Grub loading,Please waitError 18...which i found means thisError 18Error 18: Selected cylinder exceeds maximum supported by BIOSThis error is returned when a read is attempted at a linear block address beyond the end o ...

Ubuntu Error Message At Bootup

When i boot up i get this error message complaining that it is unable to allocate mem resources. I would really like to know what this means because im wondering if it is hindering anything form performing at its full capacity...here is my dmesg output i highlight the actual error message[ 0.000000] ...

ATA2.0 Error .. in Ubuntu 7.04 Server edition

Mainboard : MSI - K7N2 Delta-L/ ILSR Two sata disk (ATA Maxtor 6Y120M0 120GB) (ATA SAMSUNG SP2504C 250GB)Jun 19 00:55:10 AMBERT kernel: [ 30.818755] NFORCE2: IDE controller at PCI slot 0000:00:09.0 Jun 19 00:55:10 AMBERT kernel: [ 30.818771] NFORCE2: chipset revision 162 Jun 19 00:55:10 AMBERT kerne ...

Ubuntu Grub Error 18

I need some help. I'm getting Grub Error 18 after install Ubuntu 5.10 on an older desktop. I google'd and found the following information:http://wiki.linuxquestions.org/wiki/GRUB#Error_18Error 18: Selected cylinder exceeds maximum supported by BIOSThis error is returned when a read is attempted at a ...